Target
Alpha-1,6-mannosyl-glycoprotein 2-beta-N-acetylglucosaminyltransferase
Ligand
BDBM253627
Substrate
Meas. Tech.
MGAT LCMS Assay
pH
7.4±n/a
IC50
2.20±n/a nM
Comments
extracted
Citation
 Meng, WZhao, G Dihydropyridinone MGAT2 inhibitors for use in the treatment of metabolic disorders US Patent  US9701672 Publication Date 7/11/2017 
Target
Name:
Alpha-1,6-mannosyl-glycoprotein 2-beta-N-acetylglucosaminyltransferase
Synonyms:
2.4.1.143 GNT-II MGAT2 Mannoside acetylglucosaminyltransferase 2 Monoacylglycerol acyltransferase type 2 (h-MGAT2) h-MGAT2 (human monoacylglycerol acyltransferase type 2)
Type:
Mol. Mass.:
51567.80
Organism:
Homo sapiens (Human)
Description:
Q10469
Residue:
447
  
Inhibitor
Name:
BDBM253627
Synonyms:
US9701672, 58
Type:
Small organic molecule
Emp. Form.:
C25H25F6N5O2S
Mol. Mass.:
573.554
SMILES:
CCc1ccc(s1)C1=C(c2nnn[nH]2)C(=O)N[C@@](C1)(c1ccc(OCCCCCC(F)(F)F)cc1)C(F)(F)F
: