Target
Bcl-2-like protein 1
Ligand
BDBM21445
Substrate
Fluorescein-labeled BAD peptide
Meas. Tech.
Fluorescence Polarization Assay and FL5.12 Cellular Assay
Ki
<0.5±n/a nM
IC50
<60±n/a nM
EC50
56±n/a nM
Citation
 Bruncko, MOost, TKBelli, BADing, HJoseph, MKKunzer, AMartineau, DMcClellan, WJMitten, MNg, SCNimmer, PMOltersdorf, TPark, CMPetros, AMShoemaker, ARSong, XWang, XWendt, MDZhang, HFesik, SWRosenberg, SHElmore, SW Studies leading to potent, dual inhibitors of Bcl-2 and Bcl-xL. J Med Chem 50:641-62 (2007)  
Target
Name:
Bcl-2-like protein 1
Synonyms:
Anti-apoptotic Bcl-2 protein Apoptosis regulator Bcl-X BCL2-like 1 isoform 1 BCL2L1 Bcl-2-like protein 1 (Bcl-XL) Bcl-xL/Bcl-2-binding component 3 Bcl2-antagonist of cell death (BAD)
Type:
Mitochondrion membrane; Single-pass membrane protein
Mol. Mass.:
26039.60
Organism:
Homo sapiens (Human)
Description:
Residue:
233
  
Inhibitor
Name:
BDBM21445
Synonyms:
4-(4-{[2-(2-chlorophenyl)phenyl]methyl}piperazin-1-yl)-N-[(4-{[(2R)-4-(dimethylamino)-1-(phenylsulfanyl)butan-2-yl]amino}-3-nitrobenzene)sulfonyl]benzamide | N-Benylpiperazine derivative, 23n
Type:
Small organic molecule
Emp. Form.:
C42H45ClN6O5S2
Mol. Mass.:
813.427
SMILES:
CN(C)CC[C@H](CSc1ccccc1)Nc1ccc(cc1[N+]([O-])=O)S(=O)(=O)NC(=O)c1ccc(cc1)N1CCN(Cc2ccccc2-c2ccccc2Cl)CC1
:
Substrate
Name:
Fluorescein-labeled BAD peptide
Synonyms:
Type:
fluorescein-labeled probe
Mol. Mass.:
3078.53
Organism:
Description:
Residue:
25