Target
Cyclin-dependent kinase 6/G1/S-specific cyclin-D1
Ligand
BDBM370120
Substrate
Meas. Tech.
CDK6/Cyclin D1 Mobility Shift Assay
Ki
0.250±n/a nM
Citation
 Freeman-Cook, KDHoffman, RLNagata, ANinkovic, S CDK2/4/6 inhibitors US Patent  US10233188 Publication Date 3/19/2019 
Target
Name:
Cyclin-dependent kinase 6/G1/S-specific cyclin-D1
Synonyms:
CDK6/Cyclin D1
Type:
Enzyme
Mol. Mass.:
Description:
Components:
This complex has 2 components.
Component 1
Name:
Cyclin-dependent kinase 6
Synonyms:
CDK6 CDKN6 Cyclin-dependent kinase 6 (CDK 6) | Serine/threonine-protein kinase PLSTIRE
Type:
Enzyme Subunit
Mol. Mass.:
36937.42
Organism:
Homo sapiens (Human)
Description:
Q00534
Residue:
326
  
Component 2
Name:
G1/S-specific cyclin-D1
Synonyms:
CCND1_MOUSE Cyclin D1 | Cyl-1
Type:
Enzyme Subunit
Mol. Mass.:
33418.84
Organism:
Mus musculus (mouse)
Description:
Residue:
295
  
Inhibitor
Name:
BDBM370120
Synonyms:
6-chloro-8-[(1R,2R)-2-hydroxy-2-methylcyclopentyl]-2-{[1-(methylsulfonyl)-piperidin-4-yl]amino}pyrido[2,3-d]pyrimidin-7(8H)-one US10800783, Example 9 | US11396512, Example 9
Type:
Small organic molecule
Emp. Form.:
C19H26ClN5O4S
Mol. Mass.:
455.959
SMILES:
C[C@@]1(O)CCC[C@H]1n1c2nc(NC3CCN(CC3)S(C)(=O)=O)ncc2cc(Cl)c1=O
: