Target
Poly(ADP-ribose) glycohydrolase
Ligand
BDBM371475
Substrate
Meas. Tech.
PARG Assay
IC50
171±n/a nM
Citation
 McGonagle, AEJordan, AWaszkowycz, BHutton, CWaddell, IHitchin, JRSmith, KMHamilton, NM 2,4-dioxo-quinazoline-6-sulfonamide derivatives as inhibitors of PARG US Patent  US10239843 Publication Date 3/26/2019 
Target
Name:
Poly(ADP-ribose) glycohydrolase
Synonyms:
PARG Poly(ADP-ribose) glycohydrolase | poly(ADP-ribose) glycohydrolase (PARG)
Type:
Protein
Mol. Mass.:
111107.13
Organism:
Homo sapiens (Human)
Description:
Q86W56
Residue:
976
  
Inhibitor
Name:
BDBM371475
Synonyms:
N-[1-(Fluoromethyl)cyclopropyl]-3-[(1-methylpyrazol-4-yl)methyl]-1-[(4-methyl-1,2,4-triazol-3-yl)methyl]-2,4-dioxo-quinazoline-6-sulfonamide | US10239843, Example 584
Type:
Small organic molecule
Emp. Form.:
C21H23FN8O4S
Mol. Mass.:
502.522
SMILES:
Cn1cc(Cn2c(=O)n(Cc3nncn3C)c3ccc(cc3c2=O)S(=O)(=O)NC2(CF)CC2)cn1
: