Target
Poly(ADP-ribose) glycohydrolase
Ligand
BDBM371494
Substrate
Meas. Tech.
PARG Assay
IC50
29.0±n/a nM
Citation
 McGonagle, AEJordan, AWaszkowycz, BHutton, CWaddell, IHitchin, JRSmith, KMHamilton, NM 2,4-dioxo-quinazoline-6-sulfonamide derivatives as inhibitors of PARG US Patent  US10239843 Publication Date 3/26/2019 
Target
Name:
Poly(ADP-ribose) glycohydrolase
Synonyms:
PARG Poly(ADP-ribose) glycohydrolase | poly(ADP-ribose) glycohydrolase (PARG)
Type:
Protein
Mol. Mass.:
111107.13
Organism:
Homo sapiens (Human)
Description:
Q86W56
Residue:
976
  
Inhibitor
Name:
BDBM371494
Synonyms:
1-[(2,5-Dimethylpyrazol-3-yl)methyl]-N-[1-(fluoromethyl)cyclopropyl]-3-[(5-methyl-1,3,4-thiadiazol-2-yl)methyl]-2,4-dioxo-quinazoline-6-sulfonamide | US10239843, Example 603
Type:
Small organic molecule
Emp. Form.:
C22H24FN7O4S2
Mol. Mass.:
533.599
SMILES:
Cc1cc(Cn2c3ccc(cc3c(=O)n(Cc3nnc(C)s3)c2=O)S(=O)(=O)NC2(CF)CC2)n(C)n1
: