Target
Orexin receptor type 2
Ligand
BDBM373502
Substrate
Meas. Tech.
Cell-based Functional Assay
IC50
>5000±n/a nM
Citation
 Kamenecka, TMHe, YNguyen, WJiang, RSong, XHerr, RJJiang, Q Substituted prolines/piperidines as orexin receptor antagonists US Patent  US9896452 Publication Date 2/20/2018 
Target
Name:
Orexin receptor type 2
Synonyms:
HCRTR2 OX2R_HUMAN Orexin receptor type 2 (OR-2) Orexin receptor type 2 (OX2R) Ox-2-R | Ox2-R
Type:
Protein
Mol. Mass.:
50710.53
Organism:
Homo sapiens (Human)
Description:
O43614
Residue:
444
  
Inhibitor
Name:
BDBM373502
Synonyms:
(S)-(4,4-difluoro-2-(((5-(trifluoromethyl)pyrimidin-2-yl)amino)methyl)piperidin-1-yl)(5-methyl-2-(pyrimidin-2-yl)phenyl)methanone | US9896452, Ex. A312
Type:
Small organic molecule
Emp. Form.:
C23H21F5N6O
Mol. Mass.:
492.4445
SMILES:
Cc1ccc(-c2ncccn2)c(c1)C(=O)N1CCC(F)(F)CC1CNc1ncc(cn1)C(F)(F)F
: