Target
Fibroblast growth factor receptor 2
Ligand
BDBM261969
Substrate
Meas. Tech.
FGFR Enzymatic Assay (pre-incubated for 10 minutes)
IC50
<10±n/a nM
Citation
 Sokolsky, AWu, LYao, W Bicyclic heterocycles as FGFR4 inhibitors US Patent  US10251892 Publication Date 4/9/2019 
Target
Name:
Fibroblast growth factor receptor 2
Synonyms:
BEK FGFR-2 FGFR2 Fibroblast growth factor receptor 2 (FGFR2) KGFR Keratinocyte growth factor receptor VEGF-receptor 2 and Fibroblast growth factor receptor 2
Type:
Enzyme
Mol. Mass.:
92015.45
Organism:
Homo sapiens (Human)
Description:
P21802
Residue:
821
  
Inhibitor
Name:
BDBM261969
Synonyms:
US10251892, Example 69 US11173162, Example 69 | US9708318, 69
Type:
Small organic molecule
Emp. Form.:
C26H24F2N6O3
Mol. Mass.:
506.504
SMILES:
COc1cc(OC)c(F)c(N2Cc3cnc(cc3N(Cc3ccncc3)C2=O)-c2cn(C)nc2C)c1F
: