Target
Tyrosine-protein kinase receptor UFO
Ligand
BDBM375791
Substrate
Meas. Tech.
AXL Kinase Assay
IC50
550±n/a nM
Citation
 Hudkins, RLZulli, AL Pyrazolo[1,5-a]pyridine derivatives and methods of their use US Patent  US9914731 Publication Date 3/13/2018 
Target
Name:
Tyrosine-protein kinase receptor UFO
Synonyms:
AXL TEL/AXL UFO | UFO_HUMAN
Type:
Enzyme
Mol. Mass.:
98316.97
Organism:
Homo sapiens (Human)
Description:
P30530
Residue:
894
  
Inhibitor
Name:
BDBM375791
Synonyms:
US9914731, Ex. No. 15
Type:
Small organic molecule
Emp. Form.:
C27H21F2N5O3
Mol. Mass.:
501.4841
SMILES:
CCNc1ccn(-c2ccc(F)cc2)c(=O)c1C(=O)Nc1ccc(Oc2cccn3nccc23)c(F)c1
: