Target
Serine/threonine-protein kinase TBK1
Ligand
BDBM276850
Substrate
Meas. Tech.
Biological Assay for TBK1 and IKKepsilon
IC50
38.4±n/a nM
Citation
 Du, ZGuerrero, JAKaplan, JAKnox, Jr., JENaduthambi, DPhillips, BWVenkataramani, CWang, PWatkins, WJZablocki, J Tank-binding kinase inhibitor compounds US Patent  US10259811 Publication Date 4/16/2019 
Target
Name:
Serine/threonine-protein kinase TBK1
Synonyms:
NAK Protein cereblon/Serine/threonine-protein kinase TBK1 TANK-binding kinase 1 (TBK-1) TBK1 | TBK1_HUMAN
Type:
protein
Mol. Mass.:
83645.20
Organism:
Homo sapiens (Human)
Description:
Q9UHD2
Residue:
729
  
Inhibitor
Name:
BDBM276850
Synonyms:
US10072001, Example 36 | US10259811, Example 36
Type:
Small organic molecule
Emp. Form.:
C28H30N4O4
Mol. Mass.:
486.5622
SMILES:
CC(C)(C)OC(=O)N1CC=C(C1)c1cc2c(ccnc2[nH]1)-c1ccc(OC2CCOCC2)c(c1)C#N
: