Target
Tyrosine-protein kinase receptor
Ligand
BDBM261711
Substrate
Ki
3.10±0.1 nM
Citation
 Xiao, DXu, XLiu, XHu, YYu, HLiu, ZPeng, YSun, YLuo, HKong, FHan, YSun, J Substituted 2-aminopyridine protein kinase inhibitor US Patent  US9708295 Publication Date 7/18/2017 
Target
Name:
Tyrosine-protein kinase receptor
Synonyms:
ALK tyrosine kinase receptor (ALK) (F1174L) | ALK tyrosine kinase receptor (F1174L)
Type:
Enzyme Catalytic Domain
Mol. Mass.:
176419.08
Organism:
Homo sapiens (Human)
Description:
Residue:
1620
  
Inhibitor
Name:
BDBM261711
Synonyms:
US9708295, 53
Type:
Small organic molecule
Emp. Form.:
C25H28Cl2FN5O2
Mol. Mass.:
520.427
SMILES:
CCOc1cc(ncc1-c1cnc(N)c(O[C@H](C)c2c(Cl)ccc(F)c2Cl)c1)N1CCNC[C@@H]1C
: