Target
Fibroblast growth factor receptor 3
Ligand
BDBM261900
Substrate
Meas. Tech.
FGFR Enzymatic Assay 1
IC50
115±n/a nM
Citation
 Lu, LShen, BSokolsky, AWang, XWu, LYao, WYe, Y Bicyclic heterocycles as FGFR4 inhibitors US Patent  US9708318 Publication Date 7/18/2017 
Target
Name:
Fibroblast growth factor receptor 3
Synonyms:
CD_antigen: CD333 FGFR3 Fibroblast growth factor receptor JTK4
Type:
Protein
Mol. Mass.:
87699.57
Organism:
Homo sapiens (Human)
Description:
P22607
Residue:
806
  
Inhibitor
Name:
BDBM261900
Synonyms:
2′-(2,6-difluoro-3,5-dimethoxyphenyl)-6′-(5-morpholinopyridin-3-yl)-1′H-spiro[cyclopropane-1,4′-[2,7]naphthyridin]-3′(2′H)-one US10632126, Example 6 US9708318, 6
Type:
Small organic molecule
Emp. Form.:
C27H26F2N4O4
Mol. Mass.:
508.5165
SMILES:
COc1cc(OC)c(F)c(N2Cc3cnc(cc3C3(CC3)C2=O)-c2cncc(c2)N2CCOCC2)c1F
: