Target
Fibroblast growth factor receptor 1
Ligand
BDBM261929
Substrate
Meas. Tech.
FGFR Enzymatic Assay 1
IC50
20±n/a nM
Citation
 Lu, LShen, BSokolsky, AWang, XWu, LYao, WYe, Y Bicyclic heterocycles as FGFR4 inhibitors US Patent  US9708318 Publication Date 7/18/2017 
Target
Name:
Fibroblast growth factor receptor 1
Synonyms:
BFGFR Basic fibroblast growth factor receptor 1 (FGFR1) CEK FGFR-1 FGFR-1, (FL) FGFR1_HUMAN FLT2 Fibroblast growth factor receptor 1 (FGFR-1) Fms-like tyrosine kinase 2 N-sam bFGF-R | c-fgr
Type:
Receptor
Mol. Mass.:
91861.70
Organism:
Homo sapiens (Human)
Description:
P11362
Residue:
822
  
Inhibitor
Name:
BDBM261929
Synonyms:
3-(2,6-difluoro-3,5-dimethoxyphenyl)-7-(1,3-dimethyl-1H-pyrazol-4-yl)-1-((5-methylisoxazol-3-yl)methyl)-3,4-dihydropyrido[4,3-d]pyrimidin-2(1H)-one US10632126, Example 31 US9708318, 31
Type:
Small organic molecule
Emp. Form.:
C25H24F2N6O4
Mol. Mass.:
510.4927
SMILES:
COc1cc(OC)c(F)c(N2Cc3cnc(cc3N(Cc3cc(C)on3)C2=O)-c2cn(C)nc2C)c1F
: