Target
Fibroblast growth factor receptor 1
Ligand
BDBM261955
Substrate
Meas. Tech.
FGFR Enzymatic Assay 1
IC50
20±n/a nM
Citation
 Lu, LShen, BSokolsky, AWang, XWu, LYao, WYe, Y Bicyclic heterocycles as FGFR4 inhibitors US Patent  US9708318 Publication Date 7/18/2017 
Target
Name:
Fibroblast growth factor receptor 1
Synonyms:
BFGFR Basic fibroblast growth factor receptor 1 (FGFR1) CEK FGFR-1 FGFR-1, (FL) FGFR1_HUMAN FLT2 Fibroblast growth factor receptor 1 (FGFR-1) Fms-like tyrosine kinase 2 N-sam bFGF-R | c-fgr
Type:
Receptor
Mol. Mass.:
91861.70
Organism:
Homo sapiens (Human)
Description:
P11362
Residue:
822
  
Inhibitor
Name:
BDBM261955
Synonyms:
2′-(2,6-difluoro-3,5-dimethoxyphenyl)-6′-(1-(1-(methylsulfonyl)azetidin-3-yl)-1H-pyrazol-4-yl)-1′H-spiro[cyclopropane-1,4′-[2,7]naphthyridin]-3′(2′H)-one US10632126, Example 55 US9708318, 55
Type:
Small organic molecule
Emp. Form.:
C25H25F2N5O5S
Mol. Mass.:
545.558
SMILES:
COc1cc(OC)c(F)c(N2Cc3cnc(cc3C3(CC3)C2=O)-c2cnn(c2)C2CN(C2)S(C)(=O)=O)c1F
: