Target
Adenosine 5'-phosphosulfate reductase
Ligand
BDBM25463
Substrate
BDBM25461
Meas. Tech.
Determination of Dissociation Constant (Kd)
pH
7.5±n/a
Temperature
303.15±n/a K
Kd
46850±n/a nM
Citation
 Cosconati, SHong, JANovellino, ECarroll, KSGoodsell, DSOlson, AJ Structure-based virtual screening and biological evaluation of Mycobacterium tuberculosis adenosine 5'-phosphosulfate reductase inhibitors. J Med Chem 51:6627-30 (2008)  
Target
Name:
Adenosine 5'-phosphosulfate reductase
Synonyms:
3-phosphoadenylylsulfate reductase CYSH_MYCTO PAPS sulfotransferase cysH | phosphoadenosine phosphosulfate reductase
Type:
Oxidoreductase
Mol. Mass.:
27417.08
Organism:
Mycobacterium tuberculosis
Description:
Proteins were expressed by transforming a reductase-containing plasmid into E. coli cells.
Residue:
254
  
Inhibitor
Name:
BDBM25463
Synonyms:
2-(1,2,4-triazatriphenylen-3-ylsulfanyl)acetic acid | NSC327704
Type:
Small organic molecule
Emp. Form.:
C17H11N3O2S
Mol. Mass.:
321.353
SMILES:
OC(=O)CSc1nnc2c3ccccc3c3ccccc3c2n1
:
Substrate
Name:
BDBM25461
Synonyms:
Adenosine 5-Phosphosulfate Adenylyl sulfate | [({[(2R,3S,4R,5R)-5-(6-amino-9H-purin-9-yl)-3,4-dihydroxyoxolan-2-yl]methoxy}(hydroxy)phosphoryl)oxy]sulfonic acid
Type:
Nucleoside or nucleotide
Emp. Form.:
C10H14N5O10PS
Mol. Mass.:
427.284
SMILES:
Nc1ncnc2n(cnc12)[C@@H]1O[C@H](COP(O)(=O)OS(O)(=O)=O)[C@@H](O)[C@H]1O
: