Target
Carbonic anhydrase 13
Ligand
BDBM25896
Substrate
BDBM10856
Meas. Tech.
CA Inhibition Assay
Ki
66±n/a nM
Citation
 Temperini, CInnocenti, AScozzafava, ASupuran, CT Carbonic anhydrase inhibitors. Interaction of the antitumor sulfamate EMD 486019 with twelve mammalian carbonic anhydrase isoforms: Kinetic and X-ray crystallographic studies. Bioorg Med Chem Lett 18:4282-6 (2008)  
Target
Name:
Carbonic anhydrase 13
Synonyms:
CA-XIII Ca13 Carbonate dehydratase XIII Carbonic anhydrase XIII
Type:
Enzyme
Mol. Mass.:
29522.80
Organism:
Mus musculus (mouse)
Description:
Murine cloned isozyme
Residue:
262
  
Inhibitor
Name:
BDBM25896
Synonyms:
EMD 486019 | [2-(cycloheptylmethyl)-1,1-dioxo--benzothiophen-6-yl] sulfamate
Type:
Small organic molecule
Emp. Form.:
C16H21NO5S2
Mol. Mass.:
371.472
SMILES:
NS(=O)(=O)Oc1ccc2C=C(CC3CCCCCC3)S(=O)(=O)c2c1
:
Substrate
Name:
BDBM10856
Synonyms:
Carbon Dioxide | methanedione
Type:
Small organic molecule
Emp. Form.:
CO2
Mol. Mass.:
44.0095
SMILES:
O=C=O
: