Target
Aldo-keto reductase family 1 member C1 [L54V]
Ligand
BDBM26269
Substrate
BDBM26270
Meas. Tech.
Assay of Enzyme Activity
pH
7.4±n/a
Temperature
298.15±n/a K
Ki
85±7.6 nM
Citation
 Dhagat, UEndo, SSumii, RHara, AEl-Kabbani, O Selectivity determinants of inhibitor binding to human 20alpha-hydroxysteroid dehydrogenase: crystal structure of the enzyme in ternary complex with coenzyme and the potent inhibitor 3,5-dichlorosalicylic acid. J Med Chem 51:4844-8 (2008)  
Target
Name:
Aldo-keto reductase family 1 member C1 [L54V]
Synonyms:
20-alpha-Hydroxysteroid Dehydrogenase (AKR1C1) Mutant (L54V) AKR1C1 DDH1
Type:
Enzyme
Mol. Mass.:
36779.94
Organism:
Homo sapiens (Human)
Description:
Q04828[L54V]
Residue:
323
  
Inhibitor
Name:
BDBM26269
Synonyms:
3,5-dichloro-2-hydroxybenzoic acid CHEMBL449129
Type:
Small organic molecule
Emp. Form.:
C7H4Cl2O3
Mol. Mass.:
207.011
SMILES:
OC(=O)c1cc(Cl)cc(Cl)c1O
:
Substrate
Name:
BDBM26270
Synonyms:
(1S,2S,5R,7R,10R,11S,14S,15S)-14-[(1S)-1-hydroxyethyl]-2,15-dimethyltetracyclo[8.7.0.0^{2,7}.0^{11,15}]heptadecan-5-ol pregnanediol
Type:
Steroid
Emp. Form.:
C21H36O2
Mol. Mass.:
320.5093
SMILES:
[H][C@@]1(CC[C@@]2([H])[C@]3([H])CC[C@]4([H])C[C@H](O)CC[C@]4(C)[C@@]3([H])CC[C@]12C)[C@H](C)O
: