Target
Serine/threonine-protein kinase PLK3
Ligand
BDBM26514
Substrate
Ser/Thr 16 Peptide
Meas. Tech.
Enzymatic Activity Assay
pH
7.5±n/a
Temperature
295.15±n/a K
IC50
6.7±2.2 nM
Citation
 Kothe, MKohls, DLow, SColi, RRennie, GRFeru, FKuhn, CDing, YH Selectivity-determining residues in Plk1. Chem Biol Drug Des 70:540-6 (2007)  
Target
Name:
Serine/threonine-protein kinase PLK3
Synonyms:
CNK FGF-inducible kinase PLK3 PRK Proliferation-related kinase | Serine/threonine-protein kinase PLK3
Type:
Serine/threonine-protein kinase
Mol. Mass.:
71655.17
Organism:
Homo sapiens (Human)
Description:
Enzyme assays were using PLK3 purified from baculovirus-infected Trichoplusia ni cells expressing full-length PLK3.
Residue:
646
  
Inhibitor
Name:
BDBM26514
Synonyms:
4-{[(7R)-8-cyclopentyl-7-ethyl-5-methyl-6-oxo-5,6,7,8-tetrahydropteridin-2-yl]amino}-N-(1-methylpiperidin-4-yl)benzamide | BI 2536 analogue, 1b
Type:
Small organic molecule
Emp. Form.:
C27H37N7O2
Mol. Mass.:
491.6284
SMILES:
CC[C@H]1N(C2CCCC2)c2nc(Nc3ccc(cc3)C(=O)NC3CCN(C)CC3)ncc2N(C)C1=O
:
Substrate
Name:
Ser/Thr 16 Peptide
Synonyms:
Type:
Peptide
Mol. Mass.:
358.43
Organism:
Description:
SelectScreen Biochemical Kinase Profiling Service (Invitrogen Corporation, Carlsbad, CA, USA).
Residue:
3
NA