Target
Granulocyte-macrophage colony-stimulating factor
Ligand
BDBM65454
Substrate
Meas. Tech.
cytomteric bead array (CBA) assay
Temperature
310.15±n/a K
IC50
>10000±n/a nM
Comments
extracted
Citation
 Gandhi, ADimartino, JChopra, R Methods for the treatment of locally advanced breast cancer US Patent  US9694015 Publication Date 7/4/2017 
Target
Name:
Granulocyte-macrophage colony-stimulating factor
Synonyms:
CSF CSF2_HUMAN GM-CSF Molgramostin | Sargramostim
Type:
Protein
Mol. Mass.:
16291.07
Organism:
Homo sapiens (Human)
Description:
P04141
Residue:
144
  
Inhibitor
Name:
BDBM65454
Synonyms:
191732-72-6 Lenalidomide Revlimid US9694015, 6.1
Type:
Small organic molecule
Emp. Form.:
C13H13N3O3
Mol. Mass.:
259.2606
SMILES:
Nc1cccc2C(=O)N(Cc12)C1CCC(=O)NC1=O
: