Target
Vitamin D3 receptor
Ligand
BDBM263405
Substrate
Meas. Tech.
Dopamine D3 Receptor Binding Test
Ki
2.18±n/a nM
Citation
 Li, JChen, XMa, ZZhang, LCui, N Benzoisothiazole compounds and methods of treating schizophrenia US Patent  US9550741 Publication Date 1/24/2017 
Target
Name:
Vitamin D3 receptor
Synonyms:
1,25-dihydroxyvitamin D3 receptor Nuclear receptor subfamily 1 group I member 1 VDR | VDR_HUMAN
Type:
Protein
Mol. Mass.:
48288.72
Organism:
Homo sapiens (Human)
Description:
P11473
Residue:
427
  
Inhibitor
Name:
BDBM263405
Synonyms:
US9550741, II-15
Type:
Small organic molecule
Emp. Form.:
C28H34N4O3S3
Mol. Mass.:
570.79
SMILES:
COc1ccc2sc(cc2c1)S(=O)(=O)N[C@H]1CC[C@H](CCN2CCN(CC2)c2nsc3ccccc23)CC1
: