Target
5-hydroxytryptamine receptor 2A
Ligand
BDBM50207158
Substrate
Meas. Tech.
5-HT2A Receptor Binding Test
pH
7.7±n/a
Ki
0.530±n/a nM
Comments
extracted
Citation
 Li, JChen, XMa, ZZhang, LCui, N Benzoisothiazole compounds and methods of treating schizophrenia US Patent  US9550741 Publication Date 1/24/2017 
Target
Name:
5-hydroxytryptamine receptor 2A
Synonyms:
5-HT-2 5-HT2A 5-hydroxytryptamine receptor 2A (5HT-2A) 5HT2A_HUMAN HTR2A | Serotonin receptor 2A
Type:
undefined
Mol. Mass.:
52607.65
Organism:
Homo sapiens (Human)
Description:
P28223
Residue:
471
  
Inhibitor
Name:
BDBM50207158
Synonyms:
CHEMBL3982486 | US9550741, III-2
Type:
Small organic molecule
Emp. Form.:
C22H32N4O2S
Mol. Mass.:
416.58
SMILES:
CCOC(=O)N[C@H]1CC[C@H](CCN2CCN(CC2)c2nsc3ccccc23)CC1
: