Target
Carbonic anhydrase 15 [19-324]
Ligand
BDBM10859
Substrate
BDBM10856
Meas. Tech.
CA Inhibition Assay
pH
7.5±n/a
Temperature
293.15±n/a K
Ki
7990±n/a nM
Citation
 Hilvo, MSalzano, AMInnocenti, AKulomaa, MSScozzafava, AScaloni, AParkkila, SSupuran, CT Cloning, expression, post-translational modifications and inhibition studies on the latest mammalian carbonic anhydrase isoform, CA XV. J Med Chem 52:646-54 (2009)  
Target
Name:
Carbonic anhydrase 15 [19-324]
Synonyms:
CA-XV Ca15 Carbonate dehydratase XV | Carbonic Anhydrase XV
Type:
Enzyme
Mol. Mass.:
33409.51
Organism:
Mus musculus (mouse)
Description:
Mouse cloned isozyme.
Residue:
306
  
Inhibitor
Name:
BDBM10859
Synonyms:
4-methylbenzene-1-sulfonamide aromatic/heteroaromatic sulfonamide 4 | hCA inhibitor, 7
Type:
Small organic molecule
Emp. Form.:
C7H9NO2S
Mol. Mass.:
171.217
SMILES:
Cc1ccc(cc1)S(N)(=O)=O
:
Substrate
Name:
BDBM10856
Synonyms:
Carbon Dioxide | methanedione
Type:
Small organic molecule
Emp. Form.:
CO2
Mol. Mass.:
44.0095
SMILES:
O=C=O
: