Target
Carbonic anhydrase 15 [19-324]
Ligand
BDBM10871
Substrate
BDBM10856
Meas. Tech.
CA Inhibition Assay
pH
7.5±n/a
Temperature
293.15±n/a K
Ki
49±n/a nM
Citation
 Hilvo, MSalzano, AMInnocenti, AKulomaa, MSScozzafava, AScaloni, AParkkila, SSupuran, CT Cloning, expression, post-translational modifications and inhibition studies on the latest mammalian carbonic anhydrase isoform, CA XV. J Med Chem 52:646-54 (2009)  
Target
Name:
Carbonic anhydrase 15 [19-324]
Synonyms:
CA-XV Ca15 Carbonate dehydratase XV | Carbonic Anhydrase XV
Type:
Enzyme
Mol. Mass.:
33409.51
Organism:
Mus musculus (mouse)
Description:
Mouse cloned isozyme.
Residue:
306
  
Inhibitor
Name:
BDBM10871
Synonyms:
4-amino-N-[(4-sulfamoylphenyl)methyl]benzene-1-sulfonamide aromatic/heteroaromatic sulfonamide 16
Type:
Small organic molecule
Emp. Form.:
C13H15N3O4S2
Mol. Mass.:
341.406
SMILES:
Nc1ccc(cc1)S(=O)(=O)NCc1ccc(cc1)S(N)(=O)=O
:
Substrate
Name:
BDBM10856
Synonyms:
Carbon Dioxide | methanedione
Type:
Small organic molecule
Emp. Form.:
CO2
Mol. Mass.:
44.0095
SMILES:
O=C=O
: