Target
Oxysterols receptor LXR-alpha
Ligand
BDBM27164
Substrate
biotinylated SRC-1 peptide
Meas. Tech.
Fluorescence Resonance Energy Transfer (FRET) Ligand Sensing Assay (LiSA)
pH
7.5±n/a
Temperature
295.15±n/a K
EC50
23±n/a nM
Comments
25% efficacy.
Citation
 Washburn, DGHoang, THCampobasso, NSmallwood, AParks, DJWebb, CLFrank, KANord, MDuraiswami, CEvans, CJaye, MThompson, SK Synthesis and SAR of potent LXR agonists containing an indole pharmacophore. Bioorg Med Chem Lett 19:1097-100 (2009)  
Target
Name:
Oxysterols receptor LXR-alpha
Synonyms:
LXRA Liver X receptor alpha Liver X receptor alpha (NR1H3) NR1H3 Nuclear orphan receptor LXR-alpha | Nuclear receptor subfamily 1 group H member 3
Type:
Enzyme Catalytic Domain
Mol. Mass.:
50403.85
Organism:
Homo sapiens (Human)
Description:
Q13133
Residue:
447
  
Inhibitor
Name:
BDBM27164
Synonyms:
1H-indol-1-yl tertiary amine, 8 | {[2-chloro-3-(trifluoromethyl)phenyl]methyl}(2,2-diphenylethyl){3-[(5-methyl-1H-pyrazol-3-yl)oxy]propyl}amine
Type:
Small organic molecule
Emp. Form.:
C29H29ClF3N3O
Mol. Mass.:
528.008
SMILES:
Cc1cc(OCCCN(CC(c2ccccc2)c2ccccc2)Cc2cccc(c2Cl)C(F)(F)F)[nH]n1
:
Substrate
Name:
biotinylated SRC-1 peptide
Synonyms:
Type:
Peptide
Mol. Mass.:
3157.52
Organism:
Description:
A biotinylated peptide comprises amino acids 675-699 of steroid receptor coactivator 1 (SRC1).
Residue:
28