Target
Rho-associated protein kinase 2
Ligand
BDBM27224
Substrate
BDBM27221
Meas. Tech.
Fluorescence Polarization-Based Binding Displacement Kinase Assay
pH
7.5±n/a
Temperature
303.15±n/a K
Kd
89.7±2.4 nM
Citation
 Lavogina, DLust, MViil, IKönig, NRaidaru, GRogozina, JEnkvist, EUri, ABossemeyer, D Structural analysis of ARC-type inhibitor (ARC-1034) binding to protein kinase A catalytic subunit and rational design of bisubstrate analogue inhibitors of basophilic protein kinases. J Med Chem 52:308-21 (2009)  
Target
Name:
Rho-associated protein kinase 2
Synonyms:
KIAA0619 ROCK2 Rho kinase 2 (ROCKII) Rho-associated protein kinase 2 (ROCK2) Rho-associated protein kinase 2/Transforming protein RhoA Rho-associated, coiled-coil-containing protein kinase II p164 ROCK-2
Type:
Protein
Mol. Mass.:
160885.43
Organism:
Homo sapiens (Human)
Description:
O75116
Residue:
1388
  
Inhibitor
Name:
BDBM27224
Synonyms:
6-{[(2S,3S,4R,5R)-5-(6-amino-9H-purin-9-yl)-3,4-dihydroxyoxolan-2-yl]formamido}-N-[(1R)-4-carbamimidamido-1-carbamoylbutyl]hexanamide | ARC-1032, 6
Type:
Small organic molecule
Emp. Form.:
C22H35N11O6
Mol. Mass.:
549.5834
SMILES:
[#7]\[#6](-[#7])=[#7]/[#6]-[#6]-[#6]-[#6@@H](-[#7]-[#6](=O)-[#6]-[#6]-[#6]-[#6]-[#6]-[#7]-[#6](=O)-[#6@H]-1-[#8]-[#6@H](-[#6@H](-[#8])-[#6@@H]-1-[#8])-n1cnc2c(-[#7])ncnc12)-[#6](-[#7])=O
:
Substrate
Name:
BDBM27221
Synonyms:
Adc-Ahx-(D-Arg)(6)-D-Lys(5-TAMRA)-NH2 | Fluorescent probe ARC-583
Type:
5-TAMRA labeled compound
Emp. Form.:
Mol. Mass.:
SMILES:
: