Target
Complex of Baculoviral IAP repeat-containing protein 7 [63-159,S150G] and E3 ubiquitin-protein ligase XIAP [336-348]
Ligand
BDBM27918
Substrate
BDBM17342
Meas. Tech.
Fluorescence Polarization Affinity Measurements
pH
7.2±n/a
Temperature
295.15±n/a K
Ki
82±n/a nM
Citation
 Cohen, FAlicke, BElliott, LOFlygare, JAGoncharov, TKeteltas, SFFranklin, MCFrankovitz, SStephan, JPTsui, VVucic, DWong, HFairbrother, WJ Orally bioavailable antagonists of inhibitor of apoptosis proteins based on an azabicyclooctane scaffold. J Med Chem 52:1723-30 (2009)  
Target
Name:
Complex of Baculoviral IAP repeat-containing protein 7 [63-159,S150G] and E3 ubiquitin-protein ligase XIAP [336-348]
Synonyms:
Chimeric protein of melanoma inhibitor of apoptosis protein and XIAP-BIR3 MLXBIR3SG
Type:
Chimeric Protein
Mol. Mass.:
14953.37
Organism:
Homo sapiens (Human)
Description:
Q96CA5[63-159,S150G],P98170[336-348]
Residue:
133
  
Inhibitor
Name:
BDBM27918
Synonyms:
(2S)-N-[(2S)-1-[(3aR,6S,6aS)-6-(2,2-diphenylacetamido)-octahydrocyclopenta[b]pyrrol-1-yl]-3,3-dimethyl-1-oxobutan-2-yl]-2-(methylamino)propanamide | Azabicyclooctane scaffold, 14a
Type:
Small organic molecule
Emp. Form.:
C31H42N4O3
Mol. Mass.:
518.6902
SMILES:
[H][C@]12CC[C@H](NC(=O)C(c3ccccc3)c3ccccc3)[C@@]1([H])N(CC2)C(=O)[C@@H](NC(=O)[C@H](C)NC)C(C)(C)C
:
Substrate
Name:
BDBM17342
Synonyms:
5-carboxyflourescein(5-FAM)-conjugated AVPFFAKK | AVP-diPhe-FAM
Type:
Fluorescent dye-conjugated peptide
Emp. Form.:
Mol. Mass.:
SMILES:
: