Target
Receptor activity-modifying protein 1
Ligand
BDBM391725
Substrate
Meas. Tech.
Radioligand Binding Assay
Ki
0.063±n/a nM
Citation
 Christopher, JACongreve, MSBucknell, SJDeflorian, FPickworth, MMason, JS CGRP receptor antagonists US Patent  US10300056 Publication Date 5/28/2019 
Target
Name:
Receptor activity-modifying protein 1
Synonyms:
Calcitonin-gene-related peptide receptor, CALCRL/RAMP1 RAMP1_HUMAN
Type:
PROTEIN
Mol. Mass.:
16992.80
Organism:
Homo sapiens (Human)
Description:
EBI_100673
Residue:
148
  
Inhibitor
Name:
BDBM391725
Synonyms:
N-[(2R)-3-(7-methyl-1H- US10888561, Example 10
Type:
Small organic molecule
Emp. Form.:
C42H53N11O4
Mol. Mass.:
775.9415
SMILES:
Cc1cc(C[C@@H](NC(=O)N2CCC(CC2)N2Cc3ccccc3NC2=O)C(=O)N[C@@H](CC2CCNCC2)C(=O)N2CCN(CC2)c2ccncc2)cc2cn[nH]c12
: