Target
Nitric oxide synthase, brain
Ligand
BDBM29252
Substrate
BDBM10852
Meas. Tech.
Cell-Based NOS Transient Transfection Assay
Temperature
298.15±n/a K
EC50
360±n/a nM
Comments
extracted
Citation
 Bonnefous, CPayne, JERoppe, JZhuang, HChen, XSymons, KTNguyen, PMSablad, MRozenkrants, NZhang, YWang, LSeverance, DWalsh, JPYazdani, NShiau, AKNoble, SARix, PRao, TSHassig, CASmith, ND Discovery of inducible nitric oxide synthase (iNOS) inhibitor development candidate KD7332, part 1: Identification of a novel, potent, and selective series of quinolinone iNOS dimerization inhibitors that are orally active in rodent pain models. J Med Chem 52:3047-62 (2009)  
Target
Name:
Nitric oxide synthase, brain
Synonyms:
Constitutive NOS NC-NOS NOS type I nNOS NOS1_HUMAN Neuronal nitric oxide synthase Nitric oxide synthase, neuronal (nNOS) bNOS | nNOS
Type:
Homodimer
Mol. Mass.:
160985.98
Organism:
Homo sapiens (Human)
Description:
P29475
Residue:
1434
  
Inhibitor
Name:
BDBM29252
Synonyms:
quinolinone, 23
Type:
Small organic molecule
Emp. Form.:
C21H16ClFN4O2
Mol. Mass.:
410.829
SMILES:
Cn1cncc1C(=O)N(Cc1cc(=O)[nH]c2c(F)cccc12)c1cccc(Cl)c1
:
Substrate