Target
Genome polyprotein
Ligand
BDBM30459
Substrate
biotinylated oligo (rG13)/poly rC
Meas. Tech.
NS5B Polymerase Inhibition Assay (IC50) and HCV Replicon Assay (EC50)
pH
7.5±n/a
Temperature
301.15±n/a K
IC50
39±n/a nM
EC50
15±n/a nM
Citation
 Ellis, DABlazel, JKWebber, SETran, CVDragovich, PSSun, ZRuebsam, FMcGuire, HMXiang, AXZhao, JLi, LSZhou, YHan, QKissinger, CRShowalter, RELardy, MShah, AMTsan, MPatel, RLeBrun, LAKamran, RBartkowski, DMNolan, TGNorris, DASergeeva, MVKirkovsky, L 4-(1,1-Dioxo-1,4-dihydro-1lambda6-benzo[1,4]thiazin-3-yl)-5-hydroxy-2H-pyridazin-3-ones as potent inhibitors of HCV NS5B polymerase. Bioorg Med Chem Lett 18:4628-32 (2008)  
Target
Name:
Genome polyprotein
Synonyms:
Genome polyprotein POLG_HCVBK | RNA-directed RNA polymerase (NS5B)
Type:
Protein
Mol. Mass.:
327252.46
Organism:
Hepatitis C virus genotype 1b (isolate BK) (HCV)
Description:
P26663
Residue:
3010
  
Inhibitor
Name:
BDBM30459
Synonyms:
benzothiazine-containing analog, 3c
Type:
Small organic molecule
Emp. Form.:
C23H24N4O6S3
Mol. Mass.:
548.655
SMILES:
CS(=O)(=O)Nc1ccc2N=C(CS(=O)(=O)c2c1)c1c(O)c(nn(CC2CCCC2)c1=O)-c1cccs1
:
Substrate
Name:
biotinylated oligo (rG13)/poly rC
Synonyms:
Type:
RNA
Mol. Mass.:
358.43
Organism:
Description:
[alpha-33P]GTP/GTP as co-substrate.
Residue:
3
NA