Target
5-hydroxytryptamine receptor 1E
Ligand
BDBM31071
Substrate
Not Available
Meas. Tech.
Dose Response Cell Based Assay for Antagonists of the 5-Hydroxytryptamine Receptor Subtype 1E (5HT1E
pH
7.4±n/a
Temperature
296.15±n/a K
IC50
5201±n/a nM
Citation
 PubChem, PC Dose Response Cell Based Assay for Antagonists of the 5-Hydroxytryptamine Receptor Subtype 1E (5HT1E) PubChem Bioassay (2007)[AID] 
Target
Name:
5-hydroxytryptamine receptor 1E
Synonyms:
5-HT-1E 5-Hydroxytryptamine Receptor Subtype 1E (5HT1E) 5-hydroxytryptamine receptor 1E (5-HT-1E) (S31) 5HT1E_HUMAN S31 Serotonin 1e (5-HT1e) receptor | Serotonin Receptor 1E
Type:
G Protein-Coupled Receptor (GPCR)
Mol. Mass.:
41697.80
Organism:
Homo sapiens (Human)
Description:
gi_112822
Residue:
365
  
Inhibitor
Name:
BDBM31071
Synonyms:
(E)-3-[5-(1-azepanyl)-2-furanyl]-2-(4-fluorophenyl)-2-propenenitrile (E)-3-[5-(azepan-1-yl)furan-2-yl]-2-(4-fluorophenyl)prop-2-enenitrile MLS000051438 cid_5740802
Type:
Small organic molecule
Emp. Form.:
C19H19FN2O
Mol. Mass.:
310.3654
SMILES:
Fc1ccc(cc1)C(=C/c1ccc(o1)N1CCCCCC1)\C#N
:
Substrate
Name:
Not Available
Synonyms:
Type:
Mol. Mass.:
358.43
Organism:
Description:
Residue:
3
NA