Target
Heat shock 70 kDa protein 1A
Ligand
BDBM31717
Substrate
Fluorescein-12-ATP
Meas. Tech.
High Throughput Screening Assay for Hsp70 Inhibitors
pH
7±n/a
Temperature
296.15±n/a K
IC50
11700±n/a nM
Citation
 PubChem, PC High Throughput Screening Assay for Hsp70 Inhibitors PubChem Bioassay (2008)[AID] 
Target
Name:
Heat shock 70 kDa protein 1A
Synonyms:
HSPA1A V9GZ37_HUMAN | heat shock 70kDa protein 1A
Type:
ATP-binding protein
Mol. Mass.:
51937.99
Organism:
Homo sapiens (Human)
Description:
gi_123271505; GST-tagged ATPase domain
Residue:
476
  
Inhibitor
Name:
BDBM31717
Synonyms:
MLS000521411 [4-[(2-hydroxybenzoyl)diazenyl]anilino] benzoate benzoic acid (4-salicyloylazoanilino) ester cid_4483668
Type:
Small organic molecule
Emp. Form.:
C20H15N3O4
Mol. Mass.:
361.3508
SMILES:
Oc1ccccc1C(=O)\N=N\c1ccc(NOC(=O)c2ccccc2)cc1
:
Substrate
Name:
Fluorescein-12-ATP
Synonyms:
Type:
Mol. Mass.:
358.43
Organism:
Description:
Residue:
3
NA