Target
Dimer of Gag-Pol polyprotein [489-587]
Ligand
BDBM761
Substrate
Peptide substrate
Meas. Tech.
Protease Inhibition Assay
pH
5.5±n/a
Temperature
303.15±n/a K
IC50
0.07±n/a nM
Citation
 Vacca, JPGuare, JPdeSolms, SJSanders, WMGiuliani, EAYoung, SDDarke, PLZugay, JSigal, ISSchleif, WA L-687,908, a potent hydroxyethylene-containing HIV protease inhibitor. J Med Chem 34:1225-8 (1991)  
Target
Name:
Dimer of Gag-Pol polyprotein [489-587]
Synonyms:
HIV-1 Protease
Type:
Protein Complex
Mol. Mass.:
Description:
Components:
This complex has 2 components.
Component 1
Name:
Gag-Pol polyprotein [489-587]
Synonyms:
HIV protease HIV-1 Protease chain A POL_HV1N5 | gag-pol
Type:
Enzyme Subunit
Mol. Mass.:
10822.21
Organism:
Human immunodeficiency virus type 1
Description:
P12497[489-587]
Residue:
99
  
Component 2
Name:
Gag-Pol polyprotein [489-587]
Synonyms:
HIV protease HIV-1 Protease chain A POL_HV1N5 | gag-pol
Type:
Enzyme Subunit
Mol. Mass.:
10822.21
Organism:
Human immunodeficiency virus type 1
Description:
P12497[489-587]
Residue:
99
  
Inhibitor
Name:
BDBM761
Synonyms:
Hydroxyethylene deriv. 12 | tert-butyl N-[(2S,3S,5R)-5-({1-[(1H-1,3-benzodiazol-2-ylmethyl)carbamoyl]-2-methylbutyl}carbamoyl)-5-benzyl-3-hydroxy-1-phenylpentan-2-yl]carbamate
Type:
Small organic molecule
Emp. Form.:
C38H49N5O5
Mol. Mass.:
655.8262
SMILES:
CCC(C)C(NC(=O)[C@@H](C[C@H](O)[C@H](Cc1ccccc1)NC(=O)OC(C)(C)C)Cc1ccccc1)C(=O)NCc1nc2ccccc2[nH]1
:
Substrate
Name:
Peptide substrate
Synonyms:
Type:
Peptide
Mol. Mass.:
755.86
Organism:
Description:
Residue:
7
VSQNPIV