Target
Epithelial discoidin domain-containing receptor 1
Ligand
BDBM77638
Substrate
Meas. Tech.
LanthaScreen Eu Kinase Binding Assay
Temperature
298.15±n/a K
IC50
6.50±n/a nM
Comments
extracted
Citation
 Murata, TNiizuma, SHara, SKawada, HHada, KShimada, HTanaka, HNakanishi, Y Benzamide derivative US Patent  US9695118 Publication Date 7/4/2017 
Target
Name:
Epithelial discoidin domain-containing receptor 1
Synonyms:
CAK DDR1_HUMAN Discoidin domain-containing receptor 1 (DDR1) EDDR1 Epithelial discoidin domain receptor 1 (DDR1) Epithelial discoidin domain-containing receptor 1 (DDR1) Mammary carcinoma kinase 10 NTRK4 Protein-tyrosine kinase RTK 6 TRKE | Tyrosine-protein kinase CAK
Type:
Tyrosine-protein kinase
Mol. Mass.:
101130.02
Organism:
Homo sapiens (Human)
Description:
Q08345
Residue:
913
  
Inhibitor
Name:
BDBM77638
Synonyms:
US9695118, 161
Type:
Small organic molecule
Emp. Form.:
C23H27ClF3N3O4S
Mol. Mass.:
533.991
SMILES:
CCS(=O)(=O)c1ccc(Cl)cc1CNC(=O)c1ccc(CN2CCC[C@H](N)C2)c(OC(F)(F)F)c1
: