Target
Dimer of Gag-Pol polyprotein [501-599,A572V]
Ligand
BDBM580
Substrate
Chromogenic peptide substrate
Meas. Tech.
Protease Inhibition Assay
pH
4.7±n/a
Temperature
310.15±n/a K
Ki
<0.021±n/a nM
Km
11000±1000 nM
kcat
4.7±0.2 1/sec
Comments
Ki is below the sensitivity level of assay.
Citation
 Clemente, JCHemrajani, RBlum, LEGoodenow, MMDunn, BM Secondary mutations M36I and A71V in the human immunodeficiency virus type 1 protease can provide an advantage for the emergence of the primary mutation D30N. Biochemistry 42:15029-35 (2003)  
Target
Name:
Dimer of Gag-Pol polyprotein [501-599,A572V]
Synonyms:
HIV-1 Protease Mutant (A71V)
Type:
Protein Complex
Mol. Mass.:
Description:
Components:
This complex has 2 components.
Component 1
Name:
Gag-Pol polyprotein [501-599,A572V]
Synonyms:
HIV-1 Protease Mutant (A71V) chain A LAI (A71V) gag-pol
Type:
Enzyme Subunit
Mol. Mass.:
10823.24
Organism:
Human immunodeficiency virus type 1
Description:
P03367[501-599,A572V]
Residue:
99
  
Component 2
Name:
Gag-Pol polyprotein [501-599,A572V]
Synonyms:
HIV-1 Protease Mutant (A71V) chain A LAI (A71V) gag-pol
Type:
Enzyme Subunit
Mol. Mass.:
10823.24
Organism:
Human immunodeficiency virus type 1
Description:
P03367[501-599,A572V]
Residue:
99
  
Inhibitor
Name:
BDBM580
Synonyms:
(4R)-3-[(2S,3S)-2-hydroxy-3-[(3-hydroxy-2-methylphenyl)formamido]-4-phenylbutanoyl]-5,5-dimethyl-N-[(2-methylphenyl)methyl]-1,3-thiazolidine-4-carboxamide BDBM50288366 KNI-764
Type:
Small organic molecule
Emp. Form.:
C32H37N3O5S
Mol. Mass.:
575.718
SMILES:
Cc1ccccc1CNC(=O)[C@H]1N(CSC1(C)C)C(=O)[C@@H](O)[C@H](Cc1ccccc1)NC(=O)c1cccc(O)c1C
:
Substrate
Name:
Chromogenic peptide substrate
Synonyms:
Chromogenic peptide substrate
Type:
Peptide
Mol. Mass.:
1420.11
Organism:
Description:
Residue:
13
KARVLNPHEANLG