Target
Glycogen phosphorylase, muscle form
Ligand
BDBM34106
Substrate
BDBM23188
Meas. Tech.
Enzyme Inhibition Assay
pH
6.8±n/a
Temperature
303.15±n/a K
Ki
6600±300 nM
Citation
 Benltifa, MHayes, JMVidal, SGueyrard, DGoekjian, PGPraly, JPKizilis, GTiraidis, CAlexacou, KMChrysina, EDZographos, SELeonidas, DDArchontis, GOikonomakos, NG Glucose-based spiro-isoxazolines: a new family of potent glycogen phosphorylase inhibitors. Bioorg Med Chem 17:7368-80 (2009)  
Target
Name:
Glycogen phosphorylase, muscle form
Synonyms:
Glycogen Phosphorylase (PYGM) Glycogen phosphorylase, muscle form PYGM | PYGM_RABIT
Type:
Enzyme
Mol. Mass.:
97296.32
Organism:
Oryctolagus cuniculus (rabbit)
Description:
Phosphorylation of Ser-15 converts phosphorylase B (unphosphorylated) to phosphorylase A.
Residue:
843
  
Inhibitor
Name:
BDBM34106
Synonyms:
glucopyranosylidene-spiro-isoxazoline, 4a
Type:
Small organic molecule
Emp. Form.:
C15H19NO7
Mol. Mass.:
325.3139
SMILES:
COc1ccc(cc1)C1=NO[C@@]2(C1)O[C@H](CO)[C@@H](O)[C@H](O)[C@H]2O
:
Substrate
Name:
BDBM23188
Synonyms:
alpha-glucose-1-phosphate glucose-1-phosphate | {[(2R,3R,4S,5S,6R)-3,4,5-trihydroxy-6-(hydroxymethyl)oxan-2-yl]oxy}phosphonic acid
Type:
Emp. Form.:
C6H13O9P
Mol. Mass.:
260.1358
SMILES:
OC[C@H]1O[C@H](OP(O)(O)=O)[C@H](O)[C@@H](O)[C@@H]1O
: