Target
Carbonic anhydrase
Ligand
BDBM10889
Substrate
BDBM10856
Meas. Tech.
CA Inhibition Assay
Ki
760±n/a nM
Citation
 Innocenti, AHall, RASchlicker, CScozzafava, ASteegborn, CMühlschlegel, FASupuran, CT Carbonic anhydrase inhibitors. Inhibition and homology modeling studies of the fungal beta-carbonic anhydrase from Candida albicans with sulfonamides. Bioorg Med Chem 17:4503-9 (2009)  
Target
Name:
Carbonic anhydrase
Synonyms:
CAN_CANAL beta-Carbonic Anhydrase
Type:
Enzyme
Mol. Mass.:
31587.59
Organism:
Candida albicans (Yeast)
Description:
Residue:
281
  
Inhibitor
Name:
BDBM10889
Synonyms:
2-methoxy-N-[(1-methylpyrrolidin-2-yl)methyl]-5-sulfamoylbenzamide Sulpiride (SLP)
Type:
Small organic molecule
Emp. Form.:
C14H21N3O4S
Mol. Mass.:
327.399
SMILES:
COc1ccc(cc1C(=O)NCC1CCCN1C)S(N)(=O)=O
:
Substrate
Name:
BDBM10856
Synonyms:
Carbon Dioxide | methanedione
Type:
Small organic molecule
Emp. Form.:
CO2
Mol. Mass.:
44.0095
SMILES:
O=C=O
: