Target
Tyrosine-protein kinase receptor TYRO3
Ligand
BDBM350844
Substrate
Meas. Tech.
Inhibition Assay
IC50
6.30±n/a nM
Citation
 Wang, XZhang, WFrye, S Therapeutic uses of selected pyrrolopyrimidine compounds with anti-mer tyrosine kinase activity US Patent  US10004755 Publication Date 6/26/2018 
Target
Name:
Tyrosine-protein kinase receptor TYRO3
Synonyms:
BYK RSE TIF TYRO3_HUMAN | Tyrosine-protein kinase SKY
Type:
Protein
Mol. Mass.:
96894.13
Organism:
Homo sapiens (Human)
Description:
Q06418
Residue:
890
  
Inhibitor
Name:
BDBM350844
Synonyms:
UNC1972A US9795606, B3
Type:
Small organic molecule
Emp. Form.:
C26H36N6O3S
Mol. Mass.:
512.667
SMILES:
CCCCNc1ncc2c(cn(C3CC[C@H](N)CC3)c2n1)-c1ccc(cc1)S(=O)(=O)N1CCOCC1
: