Target
Angiopoietin-1 receptor
Ligand
BDBM35321
Substrate
Her2 Peptide Substrate
Meas. Tech.
In Vitro BRAF Kinase Assay
IC50
400±n/a nM
Citation
 Smith, ALDeMorin, FFParas, NAHuang, QPetkus, JKDoherty, EMNixey, TKim, JLWhittington, DAEpstein, LFLee, MRRose, MJBabij, CFernando, MHess, KLe, QBeltran, PCarnahan, J Selective inhibitors of the mutant B-Raf pathway: discovery of a potent and orally bioavailable aminoisoquinoline. J Med Chem 52:6189-92 (2009)  
Target
Name:
Angiopoietin-1 receptor
Synonyms:
TEK TIE2_HUMAN Tyrosine-protein kinase receptor (TIE-2) Tyrosine-protein kinase receptor TEK (p140 TEK) Tyrosine-protein kinase receptor TIE2/TEK VMCM1 p140 TEK
Type:
Enzyme
Mol. Mass.:
125835.70
Organism:
Homo sapiens (Human)
Description:
Q02763
Residue:
1124
  
Inhibitor
Name:
BDBM35321
Synonyms:
aminoisoquinoline, 14
Type:
Small organic molecule
Emp. Form.:
C27H22N8
Mol. Mass.:
458.5172
SMILES:
CNc1cc(ncn1)-c1cccnc1Nc1c(C)ccc2c(Nc3ccc(cc3)C#N)nccc12
:
Substrate
Name:
Her2 Peptide Substrate
Synonyms:
Biotinylated Her2 Peptide Substrate | biotinylated long chain peptide
Type:
Peptide
Mol. Mass.:
2278.65
Organism:
Description:
Residue:
20