Target
Vasopressin V2 receptor
Ligand
BDBM35666
Substrate
BDBM35667
Meas. Tech.
Binding Assay for Human V2 Receptor
pH
7.4±n/a
Temperature
296.15±n/a K
Ki
9.7±n/a nM
Citation
 Tsukamoto, IKoshio, HOrita, MSaitoh, CYanai-Inamura, HKitada-Nozawa, CYamamoto, EYatsu, TSakamoto, STsukamoto, S Optimization of (4,4-difluoro-1,2,3,4-tetrahydro-5H-1-benzazepine-5-ylidene)acetamide derivatives as arginine vasopressin V2 receptor agonists and discussion of their binding modes. Bioorg Med Chem 17:8161-7 (2009)  
Target
Name:
Vasopressin V2 receptor
Synonyms:
ADHR AVPR2 DIR Renal-type arginine vasopressin receptor V2R_HUMAN Vasopressin V2 receptor | Vasopressin receptor
Type:
Receptor
Mol. Mass.:
40295.28
Organism:
Homo sapiens (Human)
Description:
P30518
Residue:
371
  
Inhibitor
Name:
BDBM35666
Synonyms:
BMC173130 Compound 1t | benzazepinelidene acetamide derivative, 1b
Type:
Small organic molecule
Emp. Form.:
C25H23ClF2N4O3
Mol. Mass.:
500.925
SMILES:
Cc1ccn(n1)-c1ccc(C(=O)N2CCC(F)(F)\C(=C/C(=O)NCCO)c3ccccc23)c(Cl)c1
:
Substrate
Name:
BDBM35667
Synonyms:
AVP US10131692, 44 (AVP) [3H]Argipressin tannate | [3H]vasopressin
Type:
radiolabeled ligand
Emp. Form.:
C46H65N15O12S2
Mol. Mass.:
1084.232
SMILES:
[#7]-[#6@H]-1-[#6]-[#16]-[#16]-[#6]-[#6@H](-[#7]-[#6](=O)-[#6@H](-[#6]-[#6](-[#7])=O)-[#7]-[#6](=O)-[#6@H](-[#6]-[#6]-[#6](-[#7])=O)-[#7]-[#6](=O)-[#6@H](-[#6]-c2ccccc2)-[#7]-[#6](=O)-[#6@H](-[#6]-c2ccc(-[#8])cc2)-[#7]-[#6]-1=O)-[#6](=O)-[#7]-1-[#6]-[#6]-[#6]-[#6@H]-1-[#6](=O)-[#7]-[#6@@H](-[#6]-[#6]-[#6]\[#7]=[#6](\[#7])-[#7])-[#6](=O)-[#7]-[#6]-[#6](-[#7])=O
: