Target
Amine oxidase [flavin-containing] B
Ligand
BDBM36479
Substrate
Meas. Tech.
MAO-B Enzymatic Assay
IC50
1000±0.0 nM
Citation
 Kokel, DBryan, JLaggner, CWhite, RCheung, CYMateus, RHealey, DKim, SWerdich, AAHaggarty, SJMacrae, CAShoichet, BPeterson, RT Rapid behavior-based identification of neuroactive small molecules in the zebrafish. Nat Chem Biol 6:231-237 (2010)  
Target
Name:
Amine oxidase [flavin-containing] B
Synonyms:
AOFB_HUMAN MAOB Monoamine oxidase type B (MAO B) Monoamine oxidase type B (MAOB)
Type:
Protein
Mol. Mass.:
58768.76
Organism:
Homo sapiens (Human)
Description:
P27338
Residue:
520
  
Inhibitor
Name:
BDBM36479
Synonyms:
MAG-3
Type:
Small organic molecule
Emp. Form.:
C27H26ClNO8
Mol. Mass.:
527.95
SMILES:
CC(C)(C)OC(=O)NCCC(=O)Oc1ccc(cc1Cl)C(=O)Oc1ccc2c3CCCc3c(=O)oc2c1
: