Target
Dimer of Gag-Pol polyprotein [489-587]
Ligand
BDBM1005
Substrate
Peptide Substrate
Meas. Tech.
Protease Inhibition Assay
pH
5±n/a
Temperature
295.15±n/a K
Ki
1.7±n/a nM
Citation
 Turner, SRStrohbach, JWTommasi, RAAristoff, PAJohnson, PDSkulnick, HIDolak, LASeest, EPTomich, PKBohanon, MJHorng, MMLynn, JCChong, KTHinshaw, RRWatenpaugh, KDJanakiraman, MNThaisrivongs, S Tipranavir (PNU-140690): a potent, orally bioavailable nonpeptidic HIV protease inhibitor of the 5,6-dihydro-4-hydroxy-2-pyrone sulfonamide class. J Med Chem 41:3467-76 (1998)  
Target
Name:
Dimer of Gag-Pol polyprotein [489-587]
Synonyms:
HIV-1 Protease
Type:
Protein Complex
Mol. Mass.:
Description:
Components:
This complex has 2 components.
Component 1
Name:
Gag-Pol polyprotein [489-587]
Synonyms:
HIV protease HIV-1 Protease chain A POL_HV1N5 | gag-pol
Type:
Enzyme Subunit
Mol. Mass.:
10822.21
Organism:
Human immunodeficiency virus type 1
Description:
P12497[489-587]
Residue:
99
  
Component 2
Name:
Gag-Pol polyprotein [489-587]
Synonyms:
HIV protease HIV-1 Protease chain A POL_HV1N5 | gag-pol
Type:
Enzyme Subunit
Mol. Mass.:
10822.21
Organism:
Human immunodeficiency virus type 1
Description:
P12497[489-587]
Residue:
99
  
Inhibitor
Name:
BDBM1005
Synonyms:
N-(3-[1-(6,6-Di-(2-cyclopropylethyl)-5,6-dihydro-4-hydroxy-2-oxo-2H--pyran-3-yl)propyl]phenyl)-1-methyl-1H-imidazole-4-sulfonamide Tipranavir deriv. 16
Type:
Small organic molecule
Emp. Form.:
C28H37N3O5S
Mol. Mass.:
527.675
SMILES:
CCC(C1C(=O)CC(CCC2CC2)(CCC2CC2)OC1=O)c1cccc(NS(=O)(=O)c2cn(C)cn2)c1
:
Substrate
Name:
Peptide Substrate
Synonyms:
Type:
Peptide
Mol. Mass.:
1447.64
Organism:
Description:
The peptide was derivatized with biotin and fluorescein isothiocyanate at the amino and carboxy termini.
Residue:
12
RVSQNYPIVQNK