Target
Peptidyl-prolyl cis-trans isomerase FKBP1A
Ligand
BDBM36615
Substrate
Meas. Tech.
FKBP12 Assay
Ki
3.7±0.0 nM
EC50
2500±0.0 nM
Citation
 Luengo, JIYamashita, DSDunnington, DBeck, AKRozamus, LWYen, HKBossard, MJLevy, MAHand, ANewman-Tarr, T Structure-activity studies of rapamycin analogs: evidence that the C-7 methoxy group is part of the effector domain and positioned at the FKBP12-FRAP interface. Chem Biol 2:471-81 (1995)  
Target
Name:
Peptidyl-prolyl cis-trans isomerase FKBP1A
Synonyms:
12 kDa FK506-binding protein FK506-binding protein 1A FKB1A_HUMAN FKBP-1A FKBP12 Immunophilin FKBP12 PPIase FKBP1A Rotamase mTOR/FKBP12A/FKBP12B
Type:
Isomerase
Mol. Mass.:
11953.09
Organism:
Homo sapiens (Human)
Description:
P62942
Residue:
108
  
Inhibitor
Name:
BDBM36615
Synonyms:
Rapamycin C-7, analog 7b
Type:
Emp. Form.:
C52H80N2O14
Mol. Mass.:
957.1966
SMILES:
CO[C@@H]1C[C@H](C[C@@H](C)[C@@H]2CC(=O)[C@H](C)\C=C(C)\[C@@H](O)[C@@H](OC)C(=O)[C@H](C)C[C@H](C)\C=C\C=C\C=C(C)\[C@H](C[C@@H]3CC[C@@H](C)[C@@](O)(O3)C(=O)C(=O)N3CCCC[C@H]3C(=O)O2)NC(=O)OC)CC[C@H]1O
: