Target
5-hydroxytryptamine receptor 1A
Ligand
BDBM264120
Substrate
Meas. Tech.
Human 5-HT1A Receptor Binding Assay
pH
7.4±n/a
Ki
0.140±n/a nM
Comments
extracted
Citation
 Zhang, YJin, CZhou, R Substituted piperazine compounds and methods of use thereof US Patent  US9714232 Publication Date 7/25/2017 
Target
Name:
5-hydroxytryptamine receptor 1A
Synonyms:
5-HT-1A 5-hydroxytryptamine receptor 1A (5-HT-1A) ADRB2RL1 Dopamine D2 receptor and serotonin 1a receptor HTR1A | Serotonin receptor 1A
Type:
Mol. Mass.:
46122.49
Organism:
Homo sapiens (Human)
Description:
Residue:
422
  
Inhibitor
Name:
BDBM264120
Synonyms:
3-(4-(4-(4-(4-oxofuro[3,2-c]pyridin-5 (4H)-yl)phenyl)piperazin-1-yl)butyl)-1H-indole-5-carbonitrile | US9714232, 33
Type:
Small organic molecule
Emp. Form.:
C30H29N5O2
Mol. Mass.:
491.5836
SMILES:
O=c1n(ccc2occc12)-c1ccc(cc1)N1CCN(CCCCc2c[nH]c3ccc(cc23)C#N)CC1
: