Target
Gag-Pol polyprotein [588-1027]/[588-1147]
Ligand
BDBM1296
Substrate
(poly)rC:(oligo)dG
Meas. Tech.
HIV-1 RT Assay
pH
8.2±n/a
IC50
2700±n/a nM
Citation
 Saari, WSWai, JSFisher, TEThomas, CMHoffman, JMRooney, CSSmith, AMJones, JHBamberger, DLGoldman, ME Synthesis and evaluation of 2-pyridinone derivatives as HIV-1-specific reverse transcriptase inhibitors. 2. Analogues of 3-aminopyridin-2(1H)-one. J Med Chem 35:3792-802 (1992)  
Target
Name:
Gag-Pol polyprotein [588-1027]/[588-1147]
Synonyms:
EC: 2.7.7.49 | HIV-1 Reverse Transcriptase
Type:
Protein Complex
Mol. Mass.:
115684
Description:
Components:
This complex has 2 components.
Component 1
Name:
Gag-Pol polyprotein [588-1147]
Synonyms:
HIV-1 Reverse Transcriptase Chain A gag-pol
Type:
Enzyme Subunit
Mol. Mass.:
64486.41
Organism:
Human immunodeficiency virus type 1
Description:
P04585[588-1147]
Residue:
560
  
Component 2
Name:
Gag-Pol polyprotein [588-1027]
Synonyms:
HIV-1 Reverse Transcriptase Chain B gag-pol
Type:
Enzyme Subunit
Mol. Mass.:
51337.13
Organism:
Human immunodeficiency virus type 1
Description:
P04585[588-1027]
Residue:
440
  
Inhibitor
Name:
BDBM1296
Synonyms:
3-Aminopyridin-2(1H)-one analogue 16 | 5-ethyl-6-methyl-3-({5-oxa-3-azatricyclo[7.4.0.0^{2,6}]trideca-1(9),2(6),3,7,10,12-hexaen-4-ylmethyl}amino)-1,2-dihydropyridin-2-one
Type:
Small organic molecule
Emp. Form.:
C20H19N3O2
Mol. Mass.:
333.3838
SMILES:
CCc1cc(NCc2nc3c(ccc4ccccc34)o2)c(=O)[nH]c1C
:
Substrate
Name:
(poly)rC:(oligo)dG
Synonyms:
Type:
RNA-DNA duplex
Mol. Mass.:
358.43
Organism:
Description:
The incorporation of Tritium-labeled [3H]dGTP onto a (poly)rC:(oligo)dG template:primer.
Residue:
3
NA