Target
Dimer of Gag-Pol polyprotein [489-587]
Ligand
BDBM1487
Substrate
Peptide Substrate
Meas. Tech.
Protease Inhibition Assay
Ki
1.6±n/a nM
Citation
 Skulnick, HIJohnson, PDAristoff, PAMorris, JKLovasz, KDHowe, WJWatenpaugh, KDJanakiraman, MNAnderson, DJReischer, RJSchwartz, TMBanitt, LSTomich, PKLynn, JCHorng, MMChong, KTHinshaw, RRDolak, LASeest, EPSchwende, FJRush, BDHoward, GMToth, LNWilkinson, KRRomines, KR Structure-based design of nonpeptidic HIV protease inhibitors: the sulfonamide-substituted cyclooctylpyramones. J Med Chem 40:1149-64 (1997)  
Target
Name:
Dimer of Gag-Pol polyprotein [489-587]
Synonyms:
HIV-1 Protease
Type:
Protein Complex
Mol. Mass.:
Description:
Components:
This complex has 2 components.
Component 1
Name:
Gag-Pol polyprotein [489-587]
Synonyms:
HIV protease HIV-1 Protease chain A POL_HV1N5 | gag-pol
Type:
Enzyme Subunit
Mol. Mass.:
10822.21
Organism:
Human immunodeficiency virus type 1
Description:
P12497[489-587]
Residue:
99
  
Component 2
Name:
Gag-Pol polyprotein [489-587]
Synonyms:
HIV protease HIV-1 Protease chain A POL_HV1N5 | gag-pol
Type:
Enzyme Subunit
Mol. Mass.:
10822.21
Organism:
Human immunodeficiency virus type 1
Description:
P12497[489-587]
Residue:
99
  
Inhibitor
Name:
BDBM1487
Synonyms:
N-[3-[Cyclopropyl(5,6,7,8,9,10-hexahydro-4-hydroxy-2-oxo-2H-cycloocta[b]pyran-3-yl)methyl]phenyl]-1-methyl-1H-imidazole-4-sulfonamide Sulfonamide-Substituted Cyclooctylpyranone deriv. 37a
Type:
Small organic molecule
Emp. Form.:
C25H29N3O5S
Mol. Mass.:
483.58
SMILES:
Cn1cnc(c1)S(=O)(=O)Nc1cccc(c1)C(C1CC1)c1c(O)c2CCCCCCc2oc1=O
:
Substrate
Name:
Peptide Substrate
Synonyms:
Type:
Peptide
Mol. Mass.:
1447.64
Organism:
Description:
The peptide was derivatized with biotin and fluorescein isothiocyanate at the amino and carboxy termini.
Residue:
12
RVSQNYPIVQNK