Target
Wee1-like protein kinase
Ligand
BDBM264247
Substrate
Meas. Tech.
Wee-1 kinase Assay
Temperature
298.15±n/a K
IC50
>10000±n/a nM
Comments
extracted
Citation
 O Dowd, CRRountree, JSBurkamp, FWilkinson, AJ Substituted pyrido[4,3-d]pyrimidines as Wee-1 inhibitors US Patent  US9714244 Publication Date 7/25/2017 
Target
Name:
Wee1-like protein kinase
Synonyms:
Serine/threonine-protein kinase WEE1 WEE1 homolog (S. pombe) | WEE1_HUMAN
Type:
PROTEIN
Mol. Mass.:
71599.12
Organism:
Homo sapiens (Human)
Description:
ChEMBL_1445054
Residue:
646
  
Inhibitor
Name:
BDBM264247
Synonyms:
6-(2,6-Dichlorophenyl)-8-methyl-2-((4-(piperazin-1-yl)phenyl)amino)pyrido[4,3-d]pyrimidin-5(6H)-one | US9714244, 2
Type:
Small organic molecule
Emp. Form.:
C24H22Cl2N6O
Mol. Mass.:
481.377
SMILES:
Cc1cn(-c2c(Cl)cccc2Cl)c(=O)c2cnc(Nc3ccc(cc3)N3CCNCC3)nc12
: