Target
N-formyl peptide receptor 2
Ligand
BDBM37712
Substrate
Meas. Tech.
Dose Response Assay for Formylpeptide Receptor-Like-1 (FPRL1) Ligands and Dose Response Counter-Screen Assay for Formylpeptide Receptor (FPR) Ligands
Ki
6600±n/a nM
Comments
Extracted from aid = 520 and tid = 2
Citation
 PubChem, PC Dose Response Assay for Formylpeptide Receptor-Like-1 (FPRL1) Ligands and Dose Response Counter-Screen Assay for Formylpeptide Receptor (FPR) Ligands PubChem Bioassay (2007)[AID] 
Target
Name:
N-formyl peptide receptor 2
Synonyms:
ALXR, FPRL1, FPR2 FPR2 FPRH1 Formyl Peptide Receptor-Like 1 LXA4 receptor Lipoxin A4 receptor RFP | hFPRL
Type:
G Protein-Coupled Receptor (GPCR)
Mol. Mass.:
38968.35
Organism:
Homo sapiens (Human)
Description:
P25090
Residue:
351
  
Inhibitor
Name:
BDBM37712
Synonyms:
4-{[3-(1,4-dioxa-8-azaspiro[4.5]dec-8-yl)-6-oxo-6H-anthra[1,9-cd]isoxazol-5-yl]amino}butanoic acid SMR000021906 | cid_3239469
Type:
Small organic molecule
Emp. Form.:
C25H25N3O6
Mol. Mass.:
463.4825
SMILES:
OC(=O)CCCNc1cc(N2CCC3(CC2)OCCO3)c2noc3-c4ccccc4C(=O)c1c23
: