Target
Diphosphomevalonate decarboxylase
Ligand
BDBM38452
Substrate
Meas. Tech.
Screening for Inhibitors of the Mevalonate Pathway in Streptococcus Pneumoniae - DPM-DC Dose Response
IC50
25799.4±n/a nM
Citation
 PubChem, PC Screening for Inhibitors of the Mevalonate Pathway in Streptococcus Pneumoniae - DPM-DC Dose Response PubChem Bioassay (2007)[AID] 
Target
Name:
Diphosphomevalonate decarboxylase
Synonyms:
Type:
Enzyme Catalytic Domain
Mol. Mass.:
35571.44
Organism:
Streptococcus pneumoniae D39
Description:
A0A0H2ZN59
Residue:
317
  
Inhibitor
Name:
BDBM38452
Synonyms:
MLS000050299 N-(2,3-dithiophen-2-yl-6-quinoxalinyl)-4-morpholinecarboxamide N-[2,3-bis(2-thienyl)quinoxalin-6-yl]morpholine-4-carboxamide cid_2214213
Type:
Small organic molecule
Emp. Form.:
C21H18N4O2S2
Mol. Mass.:
422.523
SMILES:
O=C(Nc1ccc2nc(-c3cccs3)c(nc2c1)-c1cccs1)N1CCOCC1
: