Target
Dimer of Gag-Pol polyprotein [489-587]
Ligand
BDBM1679
Substrate
Fluorescent peptide substrate
Meas. Tech.
Protease Inhibition Assay
pH
5.5±n/a
Temperature
310.15±n/a K
Ki
560±100 nM
Citation
 Kaltenbach, RFNugiel, DALam, PYKlabe, RMSeitz, SP Stereoisomers of cyclic urea HIV-1 protease inhibitors: synthesis and binding affinities. J Med Chem 41:5113-7 (1998)  
Target
Name:
Dimer of Gag-Pol polyprotein [489-587]
Synonyms:
HIV-1 Protease
Type:
Protein Complex
Mol. Mass.:
Description:
Components:
This complex has 2 components.
Component 1
Name:
Gag-Pol polyprotein [489-587]
Synonyms:
HIV protease HIV-1 Protease chain A POL_HV1N5 | gag-pol
Type:
Enzyme Subunit
Mol. Mass.:
10822.21
Organism:
Human immunodeficiency virus type 1
Description:
P12497[489-587]
Residue:
99
  
Component 2
Name:
Gag-Pol polyprotein [489-587]
Synonyms:
HIV protease HIV-1 Protease chain A POL_HV1N5 | gag-pol
Type:
Enzyme Subunit
Mol. Mass.:
10822.21
Organism:
Human immunodeficiency virus type 1
Description:
P12497[489-587]
Residue:
99
  
Inhibitor
Name:
BDBM1679
Synonyms:
(4S,5S,6S,7S)-1,3,4,7-tetrabenzyl-5,6-dihydroxy-1,3-diazepan-2-one Cyclic Urea diastereomer 12
Type:
Small organic molecule
Emp. Form.:
C33H34N2O3
Mol. Mass.:
506.6347
SMILES:
O[C@@H]1[C@@H](O)[C@H](Cc2ccccc2)N(Cc2ccccc2)C(=O)N(Cc2ccccc2)[C@H]1Cc1ccccc1
:
Substrate
Name:
Fluorescent peptide substrate
Synonyms:
Type:
Peptide
Mol. Mass.:
4608.75
Organism:
Description:
Residue:
42