Target
Dual specificity protein phosphatase 1
Ligand
BDBM32004
Substrate
Meas. Tech.
In vitro MKP-1 Phosphatase Dose Response Active/Probe Assessment Assay - Effects of Catalase
IC50
>50000±n/a nM
Citation
 PubChem, PC In vitro MKP-1 Phosphatase Dose Response Active/Probe Assessment Assay - Effects of Catalase PubChem Bioassay (2006)[AID] 
Target
Name:
Dual specificity protein phosphatase 1
Synonyms:
CL100 DUSP1 MAP kinase phosphatase 1 MKP1 Protein-tyrosine phosphatase CL100 | VH1
Type:
Protein phosphatase
Mol. Mass.:
39301.48
Organism:
Homo sapiens (Human)
Description:
gi_4758204
Residue:
367
  
Inhibitor
Name:
BDBM32004
Synonyms:
2-(3-Oxo-1,3-dihydro-indol-2-ylidene)-indan-1,3-dione 2-(3-oxidanylidene-1H-indol-2-ylidene)indene-1,3-dione MLS000071738 cid_649556
Type:
Small organic molecule
Emp. Form.:
C17H9NO3
Mol. Mass.:
275.2583
SMILES:
O=[#6]-1\[#6](-[#7]-c2ccccc-12)=[#6]-1/[#6](=O)-c2ccccc2-[#6]-1=O
: