Target
Thymidylate synthase
Ligand
BDBM36661
Substrate
BDBM50028108
Meas. Tech.
Inhibition Assay
IC50
4.58e+5±n/a nM
Citation
 Fritz, TATondi, DFiner-Moore, JSCosti, MPStroud, RM Predicting and harnessing protein flexibility in the design of species-specific inhibitors of thymidylate synthase. Chem Biol 8:981-95 (2001)  
Target
Name:
Thymidylate synthase
Synonyms:
TSase Thymidylate Synthase (TS) thyA
Type:
Enzyme
Mol. Mass.:
36576.54
Organism:
Lactobacillus casei
Description:
Residue:
316
  
Inhibitor
Name:
BDBM36661
Synonyms:
5-(dimethylamino)naphthalene-1-sulfonohydrazide | Dansyl hydrazine
Type:
Small organic molecule
Emp. Form.:
C12H15N3O2S
Mol. Mass.:
265.331
SMILES:
CN(C)c1cccc2c(cccc12)S(=O)(=O)NN
:
Substrate
Name:
BDBM50028108
Synonyms:
2'-Deoxyuridinemonophosphate Phosphoric acid mono-[5-(2,4-dioxo-3,4-dihydro-2H-pyrimidin-1-yl)-3-hydroxy-tetrahydro-furan-2-ylmethyl] ester
Type:
Small organic molecule
Emp. Form.:
C9H13N2O8P
Mol. Mass.:
308.1819
SMILES:
O[C@H]1C[C@@H](O[C@@H]1COP(O)(O)=O)n1ccc(=O)[nH]c1=O
: